position,composer,work,performer,date-display,catalogue,matrix-num,cat-num,venue,label,producer-engineer,page,volume,sound-file,
"1","Lambert","God’s gardenLambert","EDNA THORNTON, organ STANLEY ROPER","16-6-15","kelly ","HO 1546 ab","3915",,"HMV",,,,,
"2","Lambert","God’s gardenLambert","EDNA THORNTON, organ STANLEY ROPER","16-6-15","kelly ","HO 1547 ab",,,"HMV",,,,,
"3","Willeby","A heap of rose leavesWilleby","EDNA THORNTON, organ STANLEY ROPER","16-11-15","kelly ","HO 2090 ab",,,"HMV",,,,,
"4","Willeby","A heap of rose leavesWilleby","EDNA THORNTON, organ STANLEY ROPER","16-11-15","kelly ","HO 2091 ab","2-3174",,"HMV",,,,,
"5","d’Hardelot","Becaused’Hardelot","EDNA THORNTON, organ STANLEY ROPER","24-11-15","kelly ","HO 2130 ab",,,"HMV",,,,,
"6","d’Hardelot","Becaused’Hardelot","EDNA THORNTON, organ STANLEY ROPER","24-11-15","kelly ","HO 2131 ab","2-3188",,"HMV",,,,,
"7","del Riego","A land of rosesdel Riego","EDNA THORNTON, organ STANLEY ROPER","24-11-15","kelly ","HO 2132 ab","2-3181",,"HMV",,,,,
"8","del Riego","A land of rosesdel Riego","EDNA THORNTON, organ STANLEY ROPER","24-11-15","kelly ","HO 2133 ab",,,"HMV",,,,,
